Target
Cholecystokinin receptor type A
Ligand
BDBM50450461
Substrate
Meas. Tech.
ChEBML_50195
IC50
1426±n/a nM
Citation
 Herrero, SSuarez-Gea, MGonzalez-Muniz, RGarcia-Lopez, MHerranz, RBallaz, SBarber, AFortuno, ADel Rio, J Pseudopeptide CCK-4 analogues incorporating the [CH(CN)NH] peptide bond surrogate Bioorg Med Chem Lett 7:855-860 (1997)    Article 
Target
Name:
Cholecystokinin receptor type A
Synonyms:
CCKAR_RAT Cholecystokinin peripheral Cholecystokinin receptor type A
Type:
Enzyme Catalytic Domain
Mol. Mass.:
49676.37
Organism:
RAT
Description:
Cholecystokinin central 0 RAT::P30551
Residue:
444
  
Inhibitor
Name:
BDBM50450461
Synonyms:
CHEMBL2367718
Type:
Small organic molecule
Emp. Form.:
C35H44N4O6
Mol. Mass.:
616.7471
SMILES:
[H][C@]12CC[C@@](C)([C@@H](C1)OC(=O)N[C@](C)(Cc1c[nH]c3ccccc13)C(=O)NC[C@H](NC(=O)CCC(O)=O)c1ccccc1)C2(C)C
: