Target
Serine protease 1
Ligand
BDBM50070501
Substrate
Meas. Tech.
ChEMBL_213031 (CHEMBL816969)
IC50
3±n/a nM
Citation
 Bajusz, SFauszt, INémeth, KBarabás, EJuhász, APatthy, M Peptidyl beta-homo-aspartals: specific inhibitors of interleukin-1 beta converting enzyme and its homologues (caspases). Bioorg Med Chem Lett 8:1477-82 (1999)  
Target
Name:
Serine protease 1
Synonyms:
Alpha-trypsin chain 1 Beta-trypsin PRSS1 TRP1 TRY1_HUMAN Thrombin & trypsin Trypsin I | Trypsin-1
Type:
Enzyme
Mol. Mass.:
26557.80
Organism:
Homo sapiens (Human)
Description:
P07477
Residue:
247
  
Inhibitor
Name:
BDBM50070501
Synonyms:
CHEMBL417682 | {(R)-1-Benzyl-2-[(R)-2-((S)-1-formyl-4-guanidino-butylcarbamoyl)-pyrrolidin-1-yl]-2-oxo-ethyl}-carbamic acid tert-butyl ester
Type:
Small organic molecule
Emp. Form.:
C25H38N6O5
Mol. Mass.:
502.6064
SMILES:
CC(C)(C)OC(=O)N[C@H](Cc1ccccc1)C(=O)N1CCC[C@@H]1C(=O)N[C@@H](CCCNC(N)=N)C=O
: