Target
Metabotropic glutamate receptor 1
Ligand
BDBM50071165
Substrate
Meas. Tech.
ChEBML_105577
IC50
>300000±n/a nM
Citation
 Valli, MJSchoepp, DDWright, RAJohnson, BGKingston, AETomlinson, RMonn, JA Synthesis and metabotropic glutamate receptor antagonist activity of N1-substituted analogs of 2R,4R-4-aminopyrrolidine-2,4-dicarboxylic acid. Bioorg Med Chem Lett 8:1985-90 (1999)  
Target
Name:
Metabotropic glutamate receptor 1
Synonyms:
GPRC1A GRM1_HUMAN Metabotropic Glutamate 1a | metabotropic glutamate 1
Type:
Enzyme
Mol. Mass.:
132358.19
Organism:
Homo sapiens (Human)
Description:
Q13255
Residue:
1194
  
Inhibitor
Name:
BDBM50071165
Synonyms:
(2R,4R)-4-Amino-1-(2-chloro-benzyl)-pyrrolidine-2,4-dicarboxylic acid | CHEMBL418462
Type:
Small organic molecule
Emp. Form.:
C13H15ClN2O4
Mol. Mass.:
298.722
SMILES:
N[C@@]1(C[C@@H](N(Cc2ccccc2Cl)C1)C(O)=O)C(O)=O
: