Target
Metabotropic glutamate receptor 3
Ligand
BDBM50049748
Substrate
Meas. Tech.
ChEBML_106374
IC50
30000±n/a nM
Citation
 Valli, MJSchoepp, DDWright, RAJohnson, BGKingston, AETomlinson, RMonn, JA Synthesis and metabotropic glutamate receptor antagonist activity of N1-substituted analogs of 2R,4R-4-aminopyrrolidine-2,4-dicarboxylic acid. Bioorg Med Chem Lett 8:1985-90 (1999)  
Target
Name:
Metabotropic glutamate receptor 3
Synonyms:
GPRC1C GRM3_HUMAN metabotropic glutamate 3 metabotropic glutamate 3/1c
Type:
Enzyme Catalytic Domain
Mol. Mass.:
98889.09
Organism:
Homo sapiens (Human)
Description:
metabotropic glutamate 1c 0 HUMAN::Q14832
Residue:
879
  
Inhibitor
Name:
BDBM50049748
Synonyms:
(2S,4S)-2-Amino-4-(4,4-diphenyl-butyl)-pentanedioic acid CHEMBL39338
Type:
Small organic molecule
Emp. Form.:
C21H25NO4
Mol. Mass.:
355.4275
SMILES:
N[C@@H](C[C@H](CCCC(c1ccccc1)c1ccccc1)C(O)=O)C(O)=O
: