Target
Plasmepsin II
Ligand
BDBM50071550
Substrate
Meas. Tech.
ChEBML_154921
Ki
220±n/a nM
Citation
 Carroll, CDPatel, HJohnson, TOGuo, TOrlowski, MHe, ZMCavallaro, CLGuo, JOksman, AGluzman, IYConnelly, JChelsky, DGoldberg, DEDolle, RE Identification of potent inhibitors of Plasmodium falciparum plasmepsin II from an encoded statine combinatorial library. Bioorg Med Chem Lett 8:2315-20 (1999)  
Target
Name:
Plasmepsin II
Synonyms:
Aspartic hemoglobinase II PLM2_PLAFX Plasmepsin 2 Plasmepsin-II
Type:
Enzyme
Mol. Mass.:
51482.09
Organism:
Plasmodium falciparum
Description:
P46925
Residue:
453
  
Inhibitor
Name:
BDBM50071550
Synonyms:
CHEMBL74562 PS-662477
Type:
Small organic molecule
Emp. Form.:
C30H43N3O6
Mol. Mass.:
541.6789
SMILES:
CCCCNC(=O)CC(O)C(Cc1ccccc1)NC(=O)[C@@H](NC(=O)c1ccc(OC)cc1OC)[C@@H](C)CC
: