Target
Dual specificity mitogen-activated protein kinase kinase 2
Ligand
BDBM50072147
Substrate
Meas. Tech.
ChEBML_103380
IC50
60±n/a nM
Citation
 Duncia, JVSantella, JBHigley, CAPitts, WJWityak, JFrietze, WERankin, FWSun, JHEarl, RATabaka, ACTeleha, CABlom, KFFavata, MFManos, EJDaulerio, AJStradley, DAHoriuchi, KCopeland, RAScherle, PATrzaskos, JMMagolda, RLTrainor, GLWexler, RRHobbs, FWOlson, RE MEK inhibitors: the chemistry and biological activity of U0126, its analogs, and cyclization products. Bioorg Med Chem Lett 8:2839-44 (1999)  
Target
Name:
Dual specificity mitogen-activated protein kinase kinase 2
Synonyms:
Dual specificity mitogen-activated protein kinase kinase 2 (MEK2) ERK activator kinase 2 MAP2K2 MAPKK 2 MKK2 PRKMK2 | VHL-MAP2K1/MAP2K2
Type:
Enzyme Catalytic Domain
Mol. Mass.:
44423.61
Organism:
Homo sapiens (Human)
Description:
gi_13489054
Residue:
400
  
Inhibitor
Name:
BDBM50072147
Synonyms:
(2Z,3Z)-2,3-bis(amino(2-aminophenylthio)methylene)succinonitrile 1,4-diamino-2,3-dicyano-1,4-bis[2-aminophenylthio]butadiene monoethanolate 2,3-Bis-[amino-(2-amino-phenylsulfanyl)-methylene]-succinonitrile 2-[1-Amino-1-(2-amino-phenylsulfanyl)-meth-(Z)-ylidene]-3-[1-amino-1-(2-amino-phenylsulfanyl)-meth-(E)-ylidene]-succinonitrile CHEMBL100473 U-0126
Type:
Small organic molecule
Emp. Form.:
C18H16N6S2
Mol. Mass.:
380.49
SMILES:
Nc1ccccc1SC(=N)C(C#N)C(C#N)C(=N)Sc1ccccc1N
: