Target
Progesterone receptor
Ligand
BDBM50072701
Substrate
Meas. Tech.
ChEMBL_159548 (CHEMBL765836)
Ki
0.440000±n/a nM
Citation
 Zhi, LTegley, CMEdwards, JPWest, SJMarschke, KBGottardis, MMMais, DEJones, TK 5-Alkyl 1,2-dihydrochromeno[3,4-f]quinolines: a novel class of nonsteroidal progesterone receptor modulators. Bioorg Med Chem Lett 8:3365-70 (1999)  
Target
Name:
Progesterone receptor
Synonyms:
NR3C3 PGR PRGR_HUMAN | progesterone
Type:
Protein
Mol. Mass.:
98979.52
Organism:
Homo sapiens (Human)
Description:
P06401
Residue:
933
  
Inhibitor
Name:
BDBM50072701
Synonyms:
9-Chloro-2,2,4,5-tetramethyl-2,5-dihydro-1H-6-oxa-1-aza-chrysene | CHEMBL286446
Type:
Small organic molecule
Emp. Form.:
C20H20ClNO
Mol. Mass.:
325.832
SMILES:
CC1Oc2ccc(Cl)cc2-c2ccc3NC(C)(C)C=C(C)c3c12
: