Target
Sodium-dependent serotonin transporter
Ligand
BDBM50069446
Substrate
Meas. Tech.
ChEBML_201359
Kd
30±n/a nM
Citation
 Carlier, PRLo, MMLo, PCRichelson, ETatsumi, MReynolds, IJSharma, TA Synthesis of a potent wide-spectrum serotonin-, norepinephrine-, dopamine-reuptake inhibitor (SNDRI) and a species-selective dopamine-reuptake inhibitor based on the gamma-amino alcohol functional group. Bioorg Med Chem Lett 8:487-92 (1999)  
Target
Name:
Sodium-dependent serotonin transporter
Synonyms:
5-HT Transporter 5HTT SC6A4_HUMAN SLC6A4 Serotonin transporter (5HTT) Sodium-dependent serotonin transporter (SERT) | Solute carrier family 6 member 4
Type:
Multi-pass membrane protein
Mol. Mass.:
70322.51
Organism:
Homo sapiens (Human)
Description:
P31645
Residue:
630
  
Inhibitor
Name:
BDBM50069446
Synonyms:
(1S,2R)-1-Cyclohexyl-3-dimethylamino-2-(4-methoxy-phenyl)-propan-1-ol; hydrochloride | CHEMBL538053
Type:
Small organic molecule
Emp. Form.:
C18H29NO2
Mol. Mass.:
291.4284
SMILES:
COc1ccc(cc1)[C@H](CN(C)C)[C@@H](O)C1CCCCC1
: