Target
Transporter
Ligand
BDBM50069454
Substrate
Meas. Tech.
ChEBML_184249
Ki
330±n/a nM
Citation
 Carlier, PRLo, MMLo, PCRichelson, ETatsumi, MReynolds, IJSharma, TA Synthesis of a potent wide-spectrum serotonin-, norepinephrine-, dopamine-reuptake inhibitor (SNDRI) and a species-selective dopamine-reuptake inhibitor based on the gamma-amino alcohol functional group. Bioorg Med Chem Lett 8:487-92 (1999)  
Target
Name:
Transporter
Synonyms:
Monoamine transporters; Norepininephrine & dopamine | Norepinephrine Monoamine transporters
Type:
PROTEIN
Mol. Mass.:
66787.87
Organism:
Rattus norvegicus
Description:
ChEMBL_1463061
Residue:
597
  
Inhibitor
Name:
BDBM50069454
Synonyms:
(1S,2R)-3-Amino-1-cyclohexyl-2-(4-methoxy-phenyl)-propan-1-ol; hydrochloride | CHEMBL540333
Type:
Small organic molecule
Emp. Form.:
C16H25NO2
Mol. Mass.:
263.3752
SMILES:
COc1ccc(cc1)[C@H](CN)[C@@H](O)C1CCCCC1
: