Target
Glutamate receptor ionotropic, NMDA 1
Ligand
BDBM50069483
Substrate
Meas. Tech.
ChEBML_140302
IC50
10±n/a nM
Citation
 Acklin, PAllgeier, HAuberson, YPBischoff, SOfner, SSauer, DSchmutz, M 5-Aminomethylquinoxaline-2,3-diones, Part III: Arylamide derivatives as highly potent and selective glycine-site NMDA receptor antagonists. Bioorg Med Chem Lett 8:493-8 (1999)  
Target
Name:
Glutamate receptor ionotropic, NMDA 1
Synonyms:
Glutamate (NMDA) receptor subunit zeta 1 Glutamate-NMDA-Channel Glutamate-NMDA-Polyamine NMDA Nmdar1 | phencyclidine
Type:
Enzyme Catalytic Domain
Mol. Mass.:
105533.40
Organism:
RAT
Description:
P35439
Residue:
938
  
Inhibitor
Name:
BDBM50069483
Synonyms:
CHEMBL356281 | N-(7-Bromo-2,3-dioxo-1,2,3,4-tetrahydro-quinoxalin-5-ylmethyl)-2-thiophen-3-yl-acetamide
Type:
Small organic molecule
Emp. Form.:
C15H12BrN3O3S
Mol. Mass.:
394.243
SMILES:
Brc1cc(CNC(=O)Cc2ccsc2)c2[nH]c(=O)c(=O)[nH]c2c1
: