Target
D(2) dopamine receptor
Ligand
BDBM50450876
Substrate
Meas. Tech.
ChEBML_58472
IC50
517±n/a nM
Citation
 Hirokawa, YMorie, TYamazaki, HYoshida, NKato, S A novel series of N-(hexahydro-1,4-diazepin-6-yl) and N-(hexahydroazepin- 3-yl)benzamides with high affinity for 5-HT3 and dopamine D2 receptors. Bioorg Med Chem Lett 8:619-24 (1999)  
Target
Name:
D(2) dopamine receptor
Synonyms:
DOPAMINE D2 DOPAMINE D2 Short Dopamine D2 receptor Drd2
Type:
G Protein-Coupled Receptor (GPCR)
Mol. Mass.:
50931.60
Organism:
Rattus norvegicus (rat)
Description:
P61169
Residue:
444
  
Inhibitor
Name:
BDBM50450876
Synonyms:
CHEMBL2093034
Type:
Small organic molecule
Emp. Form.:
C16H25ClN4O2
Mol. Mass.:
340.848
SMILES:
CCN1CCN(C)C[C@@H](C1)NC(=O)c1cc(Cl)c(N)cc1OC
: