Target
Adenosine receptor A1
Ligand
BDBM50366573
Substrate
Meas. Tech.
ChEMBL_29646 (CHEMBL639753)
Ki
3820±n/a nM
Citation
 Camp, DGreen, JMKaiser, SMMoni, RWTownsend-Nicholson, ASchofield, PRQuinn, RJ Diimidazo[1,2-c:4',5'-e]pyrimidines: adenosine agonist activity demonstrated by microphysiometry. Bioorg Med Chem Lett 8:691-4 (1999)  
Target
Name:
Adenosine receptor A1
Synonyms:
AA1R_RAT ADENOSINE A1 high Adenosine A1 receptor (A1) Adenosine receptors A1 | Adora1
Type:
Protein
Mol. Mass.:
36704.13
Organism:
Rattus norvegicus (rat)
Description:
Residue:
326
  
Inhibitor
Name:
BDBM50366573
Synonyms:
CHEMBL607912
Type:
Small organic molecule
Emp. Form.:
C18H19N5O4
Mol. Mass.:
369.3746
SMILES:
OC[C@@H]1OC([C@@H](O)[C@H]1O)n1cnc2C3=N[C@@H](CN3C=Nc12)c1ccccc1
: