Target
Adenosine receptor A1
Ligand
BDBM50366575
Substrate
Meas. Tech.
ChEMBL_28207 (CHEMBL637700)
Ki
1020±n/a nM
Citation
 Camp, DGreen, JMKaiser, SMMoni, RWTownsend-Nicholson, ASchofield, PRQuinn, RJ Diimidazo[1,2-c:4',5'-e]pyrimidines: adenosine agonist activity demonstrated by microphysiometry. Bioorg Med Chem Lett 8:691-4 (1999)  
Target
Name:
Adenosine receptor A1
Synonyms:
AA1R_RAT ADENOSINE A1 high Adenosine A1 receptor (A1) Adenosine receptors A1 | Adora1
Type:
Protein
Mol. Mass.:
36704.13
Organism:
Rattus norvegicus (rat)
Description:
Residue:
326
  
Inhibitor
Name:
BDBM50366575
Synonyms:
CHEMBL609645
Type:
Small organic molecule
Emp. Form.:
C18H20N6O4
Mol. Mass.:
384.3892
SMILES:
OC[C@@H]1OC([C@@H](O)[C@H]1O)n1cnc2c3N[C@@H](Cn3c(=N)nc12)c1ccccc1
: