Target
Adenosine receptor A1
Ligand
BDBM50004721
Substrate
Meas. Tech.
ChEBML_29467
Ki
9000±n/a nM
Citation
 Camp, DLi, YMcCluskey, AMoni, RWQuinn, RJ Diimidazo[1,2-c:4',5'-e]pyrimidines: N6-N1 conformationally restricted adenosines. Bioorg Med Chem Lett 8:695-8 (1999)  
Target
Name:
Adenosine receptor A1
Synonyms:
AA1R_RAT ADENOSINE A1 high Adenosine A1 receptor (A1) Adenosine receptors A1 | Adora1
Type:
Protein
Mol. Mass.:
36704.13
Organism:
Rattus norvegicus (rat)
Description:
Residue:
326
  
Inhibitor
Name:
BDBM50004721
Synonyms:
(S)-8-Benzyl-3-phenyl-5-propoxy-7,8-dihydro-3H-imidazo[2,1-i]purine CHEMBL321240
Type:
Small organic molecule
Emp. Form.:
C23H23N5O
Mol. Mass.:
385.4616
SMILES:
CCCOC1=Nc2c(ncn2-c2ccccc2)C2=N[C@@H](Cc3ccccc3)CN12
: