Target
Sodium channel protein type 1/2/3 subunit alpha
Ligand
BDBM50082323
Substrate
Meas. Tech.
ChEMBL_177421 (CHEMBL784400)
IC50
190±n/a nM
Citation
 Annoura, HNakanishi, KUesugi, MFukunaga, AMiyajima, ATamura-Horikawa, YTamura, S A novel class of Na+ and Ca2+ channel dual blockers with highly potent anti-ischemic effects. Bioorg Med Chem Lett 9:2999-3002 (1999)  
Target
Name:
Sodium channel protein type 1/2/3 subunit alpha
Synonyms:
Sodium channel alpha subunits; brain (Types I, II, III) | Sodium channel protein type I I alpha subunit
Type:
Mol. Mass.:
Description:
ASSAY_ID of EBI is 202416
Components:
This complex has 3 components.
Component 1
Name:
Sodium channel protein type 1 subunit alpha
Synonyms:
SCN1A_RAT Sodium (Site 1) Sodium channel protein type I alpha subunit Sodium channel protein, brain I subunit alpha Voltage-gated sodium channel subunit alpha Nav1.1
Type:
PROTEIN
Mol. Mass.:
228753.20
Organism:
Rattus norvegicus
Description:
ChEMBL_938840
Residue:
2009
  
Component 2
Name:
Sodium channel protein type 2 subunit alpha
Synonyms:
SCN2A_RAT Scn2a1 Sodium channel protein type 2 subunit alpha Sodium channel protein type II subunit alpha Voltage-gated sodium channel | Voltage-gated sodium channel subunit alpha Nav1.2
Type:
PROTEIN
Mol. Mass.:
227854.11
Organism:
Rattus norvegicus
Description:
ChEMBL_1516893
Residue:
2005
  
Component 3
Name:
Sodium channel protein type 3 subunit alpha
Synonyms:
SCN3A_RAT Sodium channel protein type 3 subunit alpha Sodium channel protein type III subunit alpha Voltage-gated sodium channel Voltage-gated sodium channel subunit alpha Nav1.3
Type:
PROTEIN
Mol. Mass.:
221371.72
Organism:
Rattus norvegicus
Description:
ChEMBL_1516894
Residue:
1951
  
Inhibitor
Name:
BDBM50082323
Synonyms:
4-[4-(4-Fluoro-benzyl)-phenyl]-1-((E)-3-phenyl-allyl)-piperidine; hydrochloride | CHEMBL543383
Type:
Small organic molecule
Emp. Form.:
C27H28FN
Mol. Mass.:
385.5163
SMILES:
Fc1ccc(Cc2ccc(cc2)C2CCN(C\C=C\c3ccccc3)CC2)cc1
: