Target
Capsid scaffolding protein
Ligand
BDBM50082150
Substrate
Meas. Tech.
ChEBML_158969
IC50
>33000±n/a nM
Citation
 Smith, DGGribble, ADHaigh, DIfe, RJLavery, PSkett, PSlingsby, BPStacey, RWard, RWWest, A The inhibition of human cytomegalovirus (hCMV) protease by hydroxylamine derivatives. Bioorg Med Chem Lett 9:3137-42 (1999)  
Target
Name:
Capsid scaffolding protein
Synonyms:
APNG Assembly protein Human cytomegalovirus protease (HCMV Pr) Protease precursor UL80 | pPR
Type:
PROTEIN
Mol. Mass.:
73854.16
Organism:
Human cytomegalovirus (strain AD169) (HHV-5) (Human herpesvirus 5)
Description:
ChEMBL_158958
Residue:
708
  
Inhibitor
Name:
BDBM50082150
Synonyms:
2-(4-Benzoyl-benzyl)-5-methyl-3H-thieno[2,3-d]pyrimidin-4-one | CHEMBL442199
Type:
Small organic molecule
Emp. Form.:
C21H16N2O2S
Mol. Mass.:
360.429
SMILES:
Cc1csc2nc(Cc3ccc(cc3)C(=O)c3ccccc3)[nH]c(=O)c12
: