Target
Lysosomal alpha-glucosidase
Ligand
BDBM18351
Substrate
Meas. Tech.
ChEBML_33934
Ki
25000±n/a nM
Citation
 Schuster, M Homoisofagomines: chemical-enzymatic synthesis and evaluation as alpha- and beta-glucosidase inhibitors. Bioorg Med Chem Lett 9:615-8 (1999)  
Target
Name:
Lysosomal alpha-glucosidase
Synonyms:
70 kDa lysosomal alpha-glucosidase Acid maltase Alpha glucosidase LYAG_HUMAN
Type:
PROTEIN
Mol. Mass.:
105312.45
Organism:
Homo sapiens (Human)
Description:
ChEMBL_1506060
Residue:
952
  
Inhibitor
Name:
BDBM18351
Synonyms:
(2R,3R,4R,5S)-2-(Hydroxymethyl)piperidine-3,4,5-triol, 10 1-Deoxynojirimycin CHEMBL307429 US9181184, 1 | dNM
Type:
natural product
Emp. Form.:
C6H13NO4
Mol. Mass.:
163.1717
SMILES:
OC[C@H]1NC[C@H](O)[C@@H](O)[C@@H]1O
: