Target
Carbonic anhydrase 2
Ligand
BDBM50088778
Substrate
Meas. Tech.
ChEBML_45239
Ki
0.500000±n/a nM
Citation
 Scozzafava, ASupuran, CT Carbonic anhydrase inhibitors: synthesis of N-morpholylthiocarbonylsulfenylamino aromatic/heterocyclic sulfonamides and their interaction with isozymes I, II and IV. Bioorg Med Chem Lett 10:1117-20 (2000)  
Target
Name:
Carbonic anhydrase 2
Synonyms:
CA-II CAC Carbonate dehydratase II Carbonic anhydrase 2 (CA-II) Carbonic anhydrase C Carbonic anhydrase II (CA-II) Carbonic anhydrase II (hCA II) | Carbonic anhydrase isoenzyme II (hCA II)
Type:
Enzyme
Mol. Mass.:
29250.71
Organism:
Homo sapiens (Human)
Description:
P00918
Residue:
260
  
Inhibitor
Name:
BDBM50088778
Synonyms:
CHEMBL275565 | N,N-dialkylthio-carbonylsulfenylamino derivative
Type:
Small organic molecule
Emp. Form.:
C14H18N6O5S5
Mol. Mass.:
510.655
SMILES:
Cn1nc(s\c1=N\S(=O)(=O)c1ccc(NSC(=S)N2CCOCC2)cc1)S(N)(=O)=O
: