Target
D(2) dopamine receptor
Ligand
BDBM81774
Substrate
Meas. Tech.
ChEMBL_61815 (CHEMBL672579)
Ki
51±n/a nM
Citation
 Einsiedel, JThomas, CHübner, HGmeiner, P Phenyloxazoles and phenylthiazoles as benzamide bioisosteres: synthesis and dopamine receptor binding profiles. Bioorg Med Chem Lett 10:2041-4 (2001)  
Target
Name:
D(2) dopamine receptor
Synonyms:
D(2) dopamine receptor DOPAMINE D2 Long DRD2 Dopamine D2 receptor Dopamine D2 receptor (D2R) Dopamine2-like | d2
Type:
Cell-surface receptors
Mol. Mass.:
50647.10
Organism:
Homo sapiens (Human)
Description:
P14416
Residue:
443
  
Inhibitor
Name:
BDBM81774
Synonyms:
CAS_15676-16-1 Sulpiride-S | Sulpiride-l
Type:
Emp. Form.:
C15H23N3O4S
Mol. Mass.:
341.426
SMILES:
CCN1CCC[C@H]1CNC(=O)c1cc(ccc1OC)S(N)(=O)=O
: