Target
D(4) dopamine receptor
Ligand
BDBM81774
Substrate
Meas. Tech.
ChEBML_60691
Ki
2100±n/a nM
Citation
 Einsiedel, JThomas, CHübner, HGmeiner, P Phenyloxazoles and phenylthiazoles as benzamide bioisosteres: synthesis and dopamine receptor binding profiles. Bioorg Med Chem Lett 10:2041-4 (2001)  
Target
Name:
D(4) dopamine receptor
Synonyms:
D(2C) dopamine receptor DOPAMINE D4.2 DRD4 Dopamine D4 receptor
Type:
Enzyme
Mol. Mass.:
48373.19
Organism:
Homo sapiens (Human)
Description:
P21917
Residue:
419
  
Inhibitor
Name:
BDBM81774
Synonyms:
CAS_15676-16-1 Sulpiride-S | Sulpiride-l
Type:
Emp. Form.:
C15H23N3O4S
Mol. Mass.:
341.426
SMILES:
CCN1CCC[C@H]1CNC(=O)c1cc(ccc1OC)S(N)(=O)=O
: