Target
Mu-type opioid receptor
Ligand
BDBM50001040
Substrate
Meas. Tech.
ChEBML_145278
Ki
360±n/a nM
Citation
 Wentland, MPXu, GCioffi, CLYe, YDuan, WCohen, DJColasurdo, AMBidlack, JM 8-Aminocyclazocine analogues: synthesis and structure-activity relationships. Bioorg Med Chem Lett 10:183-7 (2000)  
Target
Name:
Mu-type opioid receptor
Synonyms:
M-OR-1 Mu opioid receptor OPIATE Mu OPRM_CAVPO
Type:
Enzyme Catalytic Domain
Mol. Mass.:
11165.58
Organism:
GUINEA PIG
Description:
P97266
Residue:
98
  
Inhibitor
Name:
BDBM50001040
Synonyms:
6,11-Dimethyl-3-(3-methyl-butyl)-1,2,3,4,5,6-hexahydro-2,6-methano-benzo[d]azocin-8-ol | CHEMBL2021605
Type:
Small organic molecule
Emp. Form.:
C17H23NO
Mol. Mass.:
257.3706
SMILES:
[H][C@@]12Cc3ccc(O)cc3[C@@](C)(CN1CC1CC1)[C@@H]2C
: