Target
Transporter
Ligand
BDBM50035729
Substrate
Meas. Tech.
ChEMBL_143122 (CHEMBL748004)
Ki
160±n/a nM
Citation
 Blough, BEHolmquist, CRAbraham, PKuhar, MJCarroll, FI 3alpha-(4-Substituted phenyl)nortropane-2beta-carboxylic acid methyl esters show selective binding at the norepinephrine transporter. Bioorg Med Chem Lett 10:2445-7 (2001)  
Target
Name:
Transporter
Synonyms:
Monoamine transporters; Norepininephrine & dopamine | Norepinephrine Monoamine transporters
Type:
PROTEIN
Mol. Mass.:
66787.87
Organism:
Rattus norvegicus
Description:
ChEMBL_1463061
Residue:
597
  
Inhibitor
Name:
BDBM50035729
Synonyms:
8-Methyl-3-p-tolyl-8-aza-bicyclo[3.2.1]octane CHEMBL82027
Type:
Small organic molecule
Emp. Form.:
C17H23NO2
Mol. Mass.:
273.37
SMILES:
COC(=O)C1C2CCC(CC1c1ccc(C)cc1)N2C
: