Target
Adenosine receptor A2a
Ligand
BDBM50085660
Substrate
Meas. Tech.
ChEBML_31973
Ki
39±n/a nM
Citation
 Keeling, SEAlbinson, FDAyres, BEButchers, PRChambers, CLCherry, PCEllis, FEwan, GBGregson, MKnight, JMills, KRavenscroft, PReynolds, LHSanjar, SSheehan, MJ The discovery and synthesis of highly potent, A2a receptor agonists. Bioorg Med Chem Lett 10:403-6 (2000)  
Target
Name:
Adenosine receptor A2a
Synonyms:
A2A adenosine receptor (hA2A) ADENOSINE A2 ADORA2 Adenosine A2A receptor (A2AAR)
Type:
G Protein-Coupled Receptor (GPCR)
Mol. Mass.:
44716.46
Organism:
Homo sapiens (Human)
Description:
P29274
Residue:
412
  
Inhibitor
Name:
BDBM50085660
Synonyms:
(2R,3R,4S,5R)-2-{6-[2-(3-Chloro-phenyl)-ethylamino]-2-cyclopentylamino-purin-9-yl}-5-hydroxymethyl-tetrahydro-furan-3,4-diol | CHEMBL339522
Type:
Small organic molecule
Emp. Form.:
C23H29ClN6O4
Mol. Mass.:
488.967
SMILES:
OC[C@H]1O[C@H]([C@H](O)[C@@H]1O)n1cnc2c(NCCc3cccc(Cl)c3)nc(NC3CCCC3)nc12
: