Target
Adenosine receptor A3
Ligand
BDBM50100416
Substrate
Meas. Tech.
ChEBML_31699
Ki
6.2±n/a nM
Citation
 Lee, KRavi, GJi, XDMarquez, VEJacobson, KA Ring-Constrained (N)-methanocarba nucleosides as adenosine receptor agonists: independent 5'-uronamide and 2'-deoxy modifications. Bioorg Med Chem Lett 11:1333-7 (2001)  
Target
Name:
Adenosine receptor A3
Synonyms:
A3 adenosine receptor (hA3) ADORA3 | Adenosine A3 receptor (A3AR)
Type:
G Protein-Coupled Receptor (GPCR)
Mol. Mass.:
36197.32
Organism:
Homo sapiens (Human)
Description:
P0DMS8
Residue:
318
  
Inhibitor
Name:
BDBM50100416
Synonyms:
(1S,2R,3S,4R,5S)-4-(2-Chloro-6-methylamino-purin-9-yl)-2,3-dihydroxy-bicyclo[3.1.0]hexane-1-carboxylic acid methylamide 1N-methyl-4-(2-amino-6-methylamino-9H-9-purinyl)-2,3-dihydroxy-(1S,2R,3S,4R,5S)-bicyclo[3.1.0]hexane-1-carboxamide | CHEMBL283057
Type:
Small organic molecule
Emp. Form.:
C14H17ClN6O3
Mol. Mass.:
352.776
SMILES:
CNC(=O)[C@@]12C[C@@H]1[C@H]([C@H](O)[C@@H]2O)n1cnc2c(NC)nc(Cl)nc12
: