Target
Adenosine receptor A3
Ligand
BDBM50100425
Substrate
Meas. Tech.
ChEBML_31699
Ki
23±n/a nM
Citation
 Lee, KRavi, GJi, XDMarquez, VEJacobson, KA Ring-Constrained (N)-methanocarba nucleosides as adenosine receptor agonists: independent 5'-uronamide and 2'-deoxy modifications. Bioorg Med Chem Lett 11:1333-7 (2001)  
Target
Name:
Adenosine receptor A3
Synonyms:
A3 adenosine receptor (hA3) ADORA3 | Adenosine A3 receptor (A3AR)
Type:
G Protein-Coupled Receptor (GPCR)
Mol. Mass.:
36197.32
Organism:
Homo sapiens (Human)
Description:
P0DMS8
Residue:
318
  
Inhibitor
Name:
BDBM50100425
Synonyms:
(1R,2R,3S,4R,5S)-4-(2-Chloro-6-methylamino-purin-9-yl)-1-hydroxymethyl-bicyclo[3.1.0]hexane-2,3-diol | CHEMBL286739
Type:
Small organic molecule
Emp. Form.:
C13H16ClN5O3
Mol. Mass.:
325.751
SMILES:
CNc1nc(Cl)nc2n(cnc12)[C@@H]1[C@H]2C[C@@]2(CO)[C@@H](O)[C@H]1O
: