Target
Epidermal growth factor receptor
Ligand
BDBM50102088
Substrate
Meas. Tech.
ChEBML_63768
IC50
5±n/a nM
Citation
 Barker, AJGibson, KHGrundy, WGodfrey, AABarlow, JJHealy, MPWoodburn, JRAshton, SECurry, BJScarlett, LHenthorn, LRichards, L Studies leading to the identification of ZD1839 (IRESSA): an orally active, selective epidermal growth factor receptor tyrosine kinase inhibitor targeted to the treatment of cancer. Bioorg Med Chem Lett 11:1911-4 (2001)  
Target
Name:
Epidermal growth factor receptor
Synonyms:
EGF Receptor Substrate EGFR_HUMAN ERBB1 Epidermal Growth Factor Receptor erbB-1 Epidermal growth factor receptor (EGFR) HER1 Proto-oncogene c-ErbB-1 Tyrosine-Protein Kinase ErbB-1
Type:
Receptor Kinase Domain
Mol. Mass.:
134279.59
Organism:
Homo sapiens (Human)
Description:
P00533
Residue:
1210
  
Inhibitor
Name:
BDBM50102088
Synonyms:
1-[Bis-(2-hydroxy-ethyl)-amino]-3-[4-(3-chloro-4-fluoro-phenylamino)-7-methoxy-quinazolin-6-yloxy]-propan-2-ol | CHEMBL299893
Type:
Small organic molecule
Emp. Form.:
C22H26ClFN4O5
Mol. Mass.:
480.917
SMILES:
COc1cc2ncnc(Nc3ccc(F)c(Cl)c3)c2cc1OCC(O)CN(CCO)CCO
: