Target
Epidermal growth factor receptor
Ligand
BDBM50102069
Substrate
Meas. Tech.
ChEBML_63768
IC50
8±n/a nM
Citation
 Barker, AJGibson, KHGrundy, WGodfrey, AABarlow, JJHealy, MPWoodburn, JRAshton, SECurry, BJScarlett, LHenthorn, LRichards, L Studies leading to the identification of ZD1839 (IRESSA): an orally active, selective epidermal growth factor receptor tyrosine kinase inhibitor targeted to the treatment of cancer. Bioorg Med Chem Lett 11:1911-4 (2001)  
Target
Name:
Epidermal growth factor receptor
Synonyms:
EGF Receptor Substrate EGFR_HUMAN ERBB1 Epidermal Growth Factor Receptor erbB-1 Epidermal growth factor receptor (EGFR) HER1 Proto-oncogene c-ErbB-1 Tyrosine-Protein Kinase ErbB-1
Type:
Receptor Kinase Domain
Mol. Mass.:
134279.59
Organism:
Homo sapiens (Human)
Description:
P00533
Residue:
1210
  
Inhibitor
Name:
BDBM50102069
Synonyms:
(3-Chloro-4-fluoro-phenyl)-[7-methoxy-6-(2-methylamino-ethoxy)-quinazolin-4-yl]-amine | CHEMBL293090
Type:
Small organic molecule
Emp. Form.:
C18H18ClFN4O2
Mol. Mass.:
376.813
SMILES:
CNCCOc1cc2c(Nc3ccc(F)c(Cl)c3)ncnc2cc1OC
: