Target
Glucoamylase
Ligand
BDBM50403869
Substrate
Meas. Tech.
ChEBML_34270
Ki
64000±n/a nM
Citation
 Popowycz, FGerber-Lemaire, SDemange, RRodriguez-García, EAsenjo, ATRobina, IVogel, P Derivatives of (2R,3R,4S)-2-aminomethylpyrrolidine-3,4-diol are selective alpha-mannosidase inhibitors. Bioorg Med Chem Lett 11:2489-93 (2001)  
Target
Name:
Glucoamylase
Synonyms:
AMYG_ASPNG | GLAA
Type:
PROTEIN
Mol. Mass.:
68272.68
Organism:
Aspergillus niger
Description:
ChEMBL_34265
Residue:
640
  
Inhibitor
Name:
BDBM50403869
Synonyms:
CHEMBL2115197
Type:
Small organic molecule
Emp. Form.:
C6H13NO2
Mol. Mass.:
131.1729
SMILES:
CC[C@H]1NC[C@H](O)[C@@H]1O
: