Target
Substance-P receptor
Ligand
BDBM50279775
Substrate
Meas. Tech.
ChEBML_205872
Ki
0.100000±n/a nM
Citation
 Bernstein, PRAharony, DAlbert, JSAndisik, DBarthlow, HGBialecki, RDavenport, TDedinas, RFDembofsky, BTKoether, GKosmider, BJKirkland, KOhnmacht, CJPotts, WRumsey, WLShen, LShenvi, ASherwood, SStollman, DRussell, K Discovery of novel, orally active dual NK1/NK2 antagonists. Bioorg Med Chem Lett 11:2769-73 (2001)  
Target
Name:
Substance-P receptor
Synonyms:
NK-1 receptor NK1 Receptor NK1R_HUMAN Neurokinin-1 (NK-1) SPR TACR1 Tachykinin receptor 1 (NK1) | tachykinin
Type:
G Protein-Coupled Receptor (GPCR)
Mol. Mass.:
46254.43
Organism:
Homo sapiens (Human)
Description:
P25103
Residue:
407
  
Inhibitor
Name:
BDBM50279775
Synonyms:
(S)-3-Cyano-naphthalene-1-carboxylic acid {2-(3,4-dichloro-phenyl)-4-[4-(2-methanesulfinyl-phenyl)-piperidin-1-yl]-butyl}-methyl-amide CHEMBL129683
Type:
Small organic molecule
Emp. Form.:
C35H35Cl2N3O2S
Mol. Mass.:
632.642
SMILES:
CN(C[C@@H](CCN1CCC(CC1)c1ccccc1[S@](C)=O)c1ccc(Cl)c(Cl)c1)C(=O)c1cc(cc2ccccc12)C#N
: