Target
Substance-K receptor
Ligand
BDBM50175494
Substrate
Meas. Tech.
ChEBML_209035
Ki
1±n/a nM
Citation
 Bernstein, PRAharony, DAlbert, JSAndisik, DBarthlow, HGBialecki, RDavenport, TDedinas, RFDembofsky, BTKoether, GKosmider, BJKirkland, KOhnmacht, CJPotts, WRumsey, WLShen, LShenvi, ASherwood, SStollman, DRussell, K Discovery of novel, orally active dual NK1/NK2 antagonists. Bioorg Med Chem Lett 11:2769-73 (2001)  
Target
Name:
Substance-K receptor
Synonyms:
NK-2 receptor NK2R NKNAR Neurokinin A receptor Neurokinin-2 (NK-2) SKR TACR2 Tachykinin receptor 2 (NK2) | hnk-3
Type:
Protein
Mol. Mass.:
44455.78
Organism:
Homo sapiens (Human)
Description:
P21452
Residue:
398
  
Inhibitor
Name:
BDBM50175494
Synonyms:
1-{2-[(R)-3-(3,4-Dichloro-phenyl)-1-(3,4,5-trimethoxy-benzoyl)-pyrrolidin-3-yl]-ethyl}-4-phenyl-piperidine-4-carboxylic acid amide CHEMBL330366 MDL-105212
Type:
Small organic molecule
Emp. Form.:
C34H39Cl2N3O5
Mol. Mass.:
640.597
SMILES:
COc1cc(cc(OC)c1OC)C(=O)N1CC[C@@](CCN2CCC(CC2)(C(N)=O)c2ccccc2)(C1)c1ccc(Cl)c(Cl)c1
: