Target
Neuronal acetylcholine receptor subunit alpha-7
Ligand
BDBM50096712
Substrate
Meas. Tech.
ChEBML_144033
Ki
6.4±n/a nM
Citation
 Macor, JEGurley, DLanthorn, TLoch, JMack, RAMullen, GTran, OWright, NGordon, JC The 5-HT3 antagonist tropisetron (ICS 205-930) is a potent and selective alpha7 nicotinic receptor partial agonist. Bioorg Med Chem Lett 11:319-21 (2001)  
Target
Name:
Neuronal acetylcholine receptor subunit alpha-7
Synonyms:
ACHA7_MOUSE Chrna7 Neuronal nicotinic acetylcholine receptor
Type:
PROTEIN
Mol. Mass.:
56632.61
Organism:
Mus musculus
Description:
ChEMBL_144033
Residue:
502
  
Inhibitor
Name:
BDBM50096712
Synonyms:
3-(1H-Indole-3-carbonyloxy)-8,8-dimethyl-8-azonia-bicyclo[3.2.1]octane | CHEMBL111583
Type:
Small organic molecule
Emp. Form.:
C18H23N2O2
Mol. Mass.:
299.3869
SMILES:
C[N+]1(C)C2CCC1CC(C2)OC(=O)c1c[nH]c2ccccc12
: