Target
Matrix metalloproteinase-9
Ligand
BDBM50098914
Substrate
Meas. Tech.
ChEBML_105362
IC50
1.8±n/a nM
Citation
 Pikul, SDunham, KMAlmstead, NGDe, BNatchus, MGTaiwo, YOWilliams, LEHynd, BAHsieh, LCJanusz, MJGu, FMieling, GE Heterocycle-based MMP inhibitors with P2' substituents. Bioorg Med Chem Lett 11:1009-13 (2001)  
Target
Name:
Matrix metalloproteinase-9
Synonyms:
67 kDa matrix metalloproteinase-9 92 kDa gelatinase CLG4B Gelatinase B MMP9 Matrix metalloproteinase 9 (MMP-9) Matrix metalloproteinase-9 (MMP9)
Type:
Enzyme
Mol. Mass.:
78452.28
Organism:
Homo sapiens (Human)
Description:
P14780
Residue:
707
  
Inhibitor
Name:
BDBM50098914
Synonyms:
(R)-5-Hydroxycarbamoyl-4-(4-methoxy-benzenesulfonyl)-[1,4]diazepane-1-carboxylic acid benzyl ester | CHEMBL267939
Type:
Small organic molecule
Emp. Form.:
C21H25N3O7S
Mol. Mass.:
463.504
SMILES:
COc1ccc(cc1)S(=O)(=O)N1CCN(CC[C@@H]1C(=O)NO)C(=O)OCc1ccccc1
: