Target
Stromelysin-1
Ligand
BDBM50098914
Substrate
Meas. Tech.
ChEMBL_104725 (CHEMBL710726)
IC50
14±n/a nM
Citation
 Pikul, SDunham, KMAlmstead, NGDe, BNatchus, MGTaiwo, YOWilliams, LEHynd, BAHsieh, LCJanusz, MJGu, FMieling, GE Heterocycle-based MMP inhibitors with P2' substituents. Bioorg Med Chem Lett 11:1009-13 (2001)  
Target
Name:
Stromelysin-1
Synonyms:
MMP-3 MMP3_HUMAN Matrix metalloproteinase 3 Matrix metalloproteinase-3 (MMP-3) SL-1 Stromelysin 1 | Transin-1
Type:
Enzyme
Mol. Mass.:
53973.13
Organism:
Homo sapiens (Human)
Description:
P08254
Residue:
477
  
Inhibitor
Name:
BDBM50098914
Synonyms:
(R)-5-Hydroxycarbamoyl-4-(4-methoxy-benzenesulfonyl)-[1,4]diazepane-1-carboxylic acid benzyl ester | CHEMBL267939
Type:
Small organic molecule
Emp. Form.:
C21H25N3O7S
Mol. Mass.:
463.504
SMILES:
COc1ccc(cc1)S(=O)(=O)N1CCN(CC[C@@H]1C(=O)NO)C(=O)OCc1ccccc1
: