Target
D(2) dopamine receptor
Ligand
BDBM50103072
Substrate
Meas. Tech.
ChEMBL_58682 (CHEMBL670246)
IC50
>1000±n/a nM
Citation
 Iriepa, IVillasante, FJGálvez, ELabeaga, LInnerarity, AOrjales, A Synthesis and pharmacology of isoquinuclidine derivatives as 5-HT(3) ligands. Bioorg Med Chem Lett 12:189-92 (2001)  
Target
Name:
D(2) dopamine receptor
Synonyms:
DOPAMINE D2 DOPAMINE D2 Short Dopamine D2 receptor Drd2
Type:
G Protein-Coupled Receptor (GPCR)
Mol. Mass.:
50931.60
Organism:
Rattus norvegicus (rat)
Description:
P61169
Residue:
444
  
Inhibitor
Name:
BDBM50103072
Synonyms:
1-Benzyl-2-piperazin-1-yl-1H-benzoimidazole Lerisetron
Type:
Small organic molecule
Emp. Form.:
C18H20N4
Mol. Mass.:
292.3782
SMILES:
C(c1ccccc1)n1c(nc2ccccc12)N1CCNCC1
: