Target
Vasopressin V1a receptor
Ligand
BDBM50366798
Substrate
Meas. Tech.
ChEBML_214566
Ki
79±n/a nM
Citation
 Kakefuda, ATsukada, JKusayama, TTahara, ATsukamoto, S N-Methylbenzanilide derivatives as a novel class of selective V(1A) receptor antagonists. Bioorg Med Chem Lett 12:229-32 (2001)  
Target
Name:
Vasopressin V1a receptor
Synonyms:
Avpr1a VASOPRESSIN V1A Vasopressin V1a receptor | Vasopressin receptor
Type:
Enzyme Catalytic Domain
Mol. Mass.:
47674.81
Organism:
RAT
Description:
VASOPRESSIN V1A AVPR1A RAT::P30560
Residue:
424
  
Inhibitor
Name:
BDBM50366798
Synonyms:
CHEMBL1794053
Type:
Small organic molecule
Emp. Form.:
C18H11Br2N3O2S
Mol. Mass.:
493.172
SMILES:
Nc1nc(cs1)-c1ccc2NC(=O)C(=Cc3cc(Br)c(O)c(Br)c3)c2c1
: