Target
Vasopressin V2 receptor
Ligand
BDBM50108497
Substrate
Meas. Tech.
ChEMBL_211258 (CHEMBL885387)
Ki
2040±n/a nM
Citation
 Kakefuda, ATsukada, JKusayama, TTahara, ATsukamoto, S N-Methylbenzanilide derivatives as a novel class of selective V(1A) receptor antagonists. Bioorg Med Chem Lett 12:229-32 (2001)  
Target
Name:
Vasopressin V2 receptor
Synonyms:
AVPR V2 Avpr2 V2R_RAT Vasopressin receptor
Type:
G-protein coupled receptor
Mol. Mass.:
40761.85
Organism:
Rattus norvegicus (Rat)
Description:
Residue:
371
  
Inhibitor
Name:
BDBM50108497
Synonyms:
2-Methyl-furan-3-carboxylic acid (4-{[4'-([1,4']bipiperidinyl-1'-carbonyl)-biphenyl-2-yl]-methyl-carbamoyl}-phenyl)-amide | CHEMBL307487
Type:
Small organic molecule
Emp. Form.:
C37H40N4O4
Mol. Mass.:
604.7379
SMILES:
CN(C(=O)c1ccc(NC(=O)c2ccoc2C)cc1)c1ccccc1-c1ccc(cc1)C(=O)N1CCC(CC1)N1CCCCC1
: