Target
Vasopressin V1a receptor
Ligand
BDBM50108499
Substrate
Meas. Tech.
ChEBML_214566
Ki
7.6±n/a nM
Citation
 Kakefuda, ATsukada, JKusayama, TTahara, ATsukamoto, S N-Methylbenzanilide derivatives as a novel class of selective V(1A) receptor antagonists. Bioorg Med Chem Lett 12:229-32 (2001)  
Target
Name:
Vasopressin V1a receptor
Synonyms:
Avpr1a VASOPRESSIN V1A Vasopressin V1a receptor | Vasopressin receptor
Type:
Enzyme Catalytic Domain
Mol. Mass.:
47674.81
Organism:
RAT
Description:
VASOPRESSIN V1A AVPR1A RAT::P30560
Residue:
424
  
Inhibitor
Name:
BDBM50108499
Synonyms:
1N-methyl-1N-{4-methyl-2-[4-(4-methylhexahydro-1-pyrazinylcarbonyl)benzyloxy]phenyl}-4-[2-(2-ethyl-1H-1-imidazolyl)phenylcarboxamido]benzamide | CHEMBL75489
Type:
Small organic molecule
Emp. Form.:
C40H42N6O4
Mol. Mass.:
670.7993
SMILES:
CCc1nccn1-c1ccccc1C(=O)Nc1ccc(cc1)C(=O)N(C)c1ccc(C)cc1OCc1ccc(cc1)C(=O)N1CCN(C)CC1
: