Target
Vasopressin V2 receptor
Ligand
BDBM50108501
Substrate
Meas. Tech.
ChEMBL_211258 (CHEMBL885387)
Ki
34±n/a nM
Citation
 Kakefuda, ATsukada, JKusayama, TTahara, ATsukamoto, S N-Methylbenzanilide derivatives as a novel class of selective V(1A) receptor antagonists. Bioorg Med Chem Lett 12:229-32 (2001)  
Target
Name:
Vasopressin V2 receptor
Synonyms:
AVPR V2 Avpr2 V2R_RAT Vasopressin receptor
Type:
G-protein coupled receptor
Mol. Mass.:
40761.85
Organism:
Rattus norvegicus (Rat)
Description:
Residue:
371
  
Inhibitor
Name:
BDBM50108501
Synonyms:
2-Methyl-furan-3-carboxylic acid (4-{5-[2-(4-dimethylamino-piperidin-1-yl)-2-oxo-ethylidene]-4,4-difluoro-2,3,4,5-tetrahydro-benzo[b]azepine-1-carbonyl}-phenyl)-amide | CHEMBL310921
Type:
Small organic molecule
Emp. Form.:
C32H34F2N4O4
Mol. Mass.:
576.6336
SMILES:
CN(C)C1CCN(CC1)C(=O)\C=C1/c2ccccc2N(CCC1(F)F)C(=O)c1ccc(NC(=O)c2ccoc2C)cc1
: