Target
D(2) dopamine receptor
Ligand
BDBM50061669
Substrate
Meas. Tech.
ChEBML_62080
Ki
0.200000±n/a nM
Citation
 Mewshaw, REZhao, RShi, XMarquis, KBrennan, JAMazandarani, HCoupet, JAndree, TH New generation dopaminergic agents. Part 8: heterocyclic bioisosteres that exploit the 7-OH-2-(aminomethyl)chroman D(2) template. Bioorg Med Chem Lett 12:271-4 (2002)  
Target
Name:
D(2) dopamine receptor
Synonyms:
DOPAMINE D2 DOPAMINE D2 Short Dopamine D2 receptor Drd2
Type:
G Protein-Coupled Receptor (GPCR)
Mol. Mass.:
50931.60
Organism:
Rattus norvegicus (rat)
Description:
P61169
Residue:
444
  
Inhibitor
Name:
BDBM50061669
Synonyms:
(R)-2-(Benzylamino-methyl)-chroman-7-ol; oxalic acid CHEMBL64553
Type:
Small organic molecule
Emp. Form.:
C17H19NO2
Mol. Mass.:
269.3383
SMILES:
Oc1ccc2CC[C@H](CNCc3ccccc3)Oc2c1
: