Target
Tubulin beta-2B chain
Ligand
BDBM50014846
Substrate
Meas. Tech.
ChEBML_211170
Ki
780±n/a nM
Citation
 Li, QWoods, KWClaiborne, AGwaltney, SLBarr, KJLiu, GGehrke, LCredo, RBHui, YHLee, JWarner, RBKovar, PNukkala, MAZielinski, NATahir, SKFitzgerald, MKim, KHMarsh, KFrost, DNg, SCRosenberg, SSham, HL Synthesis and biological evaluation of 2-indolyloxazolines as a new class of tubulin polymerization inhibitors. Discovery of A-289099 as an orally active antitumor agent. Bioorg Med Chem Lett 12:465-9 (2002)  
Target
Name:
Tubulin beta-2B chain
Synonyms:
TBB2B_BOVIN Tubulin | Tubulin beta chain
Type:
PROTEIN
Mol. Mass.:
49932.38
Organism:
Bos taurus
Description:
ChEMBL_211651
Residue:
445
  
Inhibitor
Name:
BDBM50014846
Synonyms:
(S)-N-(5,6,7,9-tetrahydro-1,2,3,10-tetramethoxy-9-oxobenzo[a]heptalen-7-yl)acetamide 7alphaH-colchicine COLCHICINE colchicina | colchicinum
Type:
Small organic molecule
Emp. Form.:
C22H25NO6
Mol. Mass.:
399.437
SMILES:
COc1cc2CC[C@H](NC(C)=O)c3cc(=O)c(OC)ccc3-c2c(OC)c1OC
: