Target
Trypsin
Ligand
BDBM50110387
Substrate
Meas. Tech.
ChEMBL_212872 (CHEMBL817822)
Ki
2.5±n/a nM
Citation
 Ho, JZGibson, TSSemple, JE Novel, potent non-covalent thrombin inhibitors incorporating p(3)-lactam scaffolds. Bioorg Med Chem Lett 12:743-8 (2002)  
Target
Name:
Trypsin
Synonyms:
Serine protease 1/Trypsin-2/Trypsin-3
Type:
Mol. Mass.:
Description:
ASSAY_ID of ChEMBL is 2155713
Components:
This complex has 3 components.
Component 1
Name:
Serine protease 1
Synonyms:
Alpha-trypsin chain 1 Beta-trypsin PRSS1 TRP1 TRY1_HUMAN Thrombin & trypsin Trypsin I | Trypsin-1
Type:
Enzyme
Mol. Mass.:
26557.80
Organism:
Homo sapiens (Human)
Description:
P07477
Residue:
247
  
Component 2
Name:
Trypsin-2
Synonyms:
Anionic trypsinogen Serine protease 2 TRY2_HUMAN Thrombin & trypsin Trypsin II | Trypsin-2
Type:
PROTEIN
Mol. Mass.:
26479.43
Organism:
Homo sapiens (Human)
Description:
ChEMBL_41517
Residue:
247
  
Component 3
Name:
Trypsin-3
Synonyms:
Brain trypsinogen PRSS3 Serine protease 3 TRY3 TRY4 Trypsin Trypsin IV | Trypsin-3
Type:
PROTEIN
Mol. Mass.:
32532.52
Organism:
Homo sapiens (Human)
Description:
ChEMBL_216043
Residue:
304
  
Inhibitor
Name:
BDBM50110387
Synonyms:
4-{2-[(S)-5-((S)-2,3-Dihydro-benzofuran-5-sulfonylamino)-4-oxo-1,2,4,5,6,7-hexahydro-azepino[3,2,1-hi]indol-2-yl]-2-oxo-ethyl}-piperidine-1-carboxamidine | CHEMBL163312
Type:
Small organic molecule
Emp. Form.:
C28H33N5O5S
Mol. Mass.:
551.657
SMILES:
NC(=N)N1CCC(CC(=O)[C@@H]2Cc3cccc4CC[C@H](NS(=O)(=O)c5ccc6OCCc6c5)C(=O)N2c34)CC1
: