Target
Prothrombin
Ligand
BDBM50111109
Substrate
Meas. Tech.
ChEBML_208337
Ki
0.044000±n/a nM
Citation
 Lee, KJung, WHPark, CWPark, HDLee, SHKwon, OH Noncovalent tripeptidic thrombin inhibitors incorporating amidrazone, amine and amidine functions at P1. Bioorg Med Chem Lett 12:1017-22 (2002)  
Target
Name:
Prothrombin
Synonyms:
Activation peptide fragment 1 Coagulation factor II Prothrombin precursor Thrombin heavy chain | Thrombin light chain
Type:
Protein
Mol. Mass.:
70029.57
Organism:
Homo sapiens (Human)
Description:
P00734
Residue:
622
  
Inhibitor
Name:
BDBM50111109
Synonyms:
{(R)-1-Benzhydryl-2-[(S)-2-(4-carbamimidoyl-benzylcarbamoyl)-pyrrolidin-1-yl]-2-oxo-ethyl}-phosphoramidic acid dimethyl ester; trifluoroacetate
Type:
Small organic molecule
Emp. Form.:
C30H36N5O6P
Mol. Mass.:
593.6116
SMILES:
COP([O-])([O-])(N[C@H](C(c1ccccc1)c1ccccc1)C(=O)N1CCC[C@H]1C(=O)NCc1ccc(cc1)C(N)=N)OC
: