Target
Estrogen receptor beta
Ligand
BDBM50129152
Substrate
Meas. Tech.
ChEMBL_66049 (CHEMBL679018)
IC50
>1000±n/a nM
Citation
 Zhi, LTegley, CMPio, BEdwards, JPJones, TKMarschke, KBMais, DERisek, BSchrader, WT Synthesis and biological activity of 5-methylidene 1,2-dihydrochromeno[3,4-f]quinoline derivatives as progesterone receptor modulators. Bioorg Med Chem Lett 13:2071-4 (2003)  
Target
Name:
Estrogen receptor beta
Synonyms:
Estrogen receptor
Type:
Mol. Mass.:
Description:
ASSAY_ID of ChEMBL is 99778
Components:
This complex has 2 components.
Component 1
Name:
Estrogen receptor beta
Synonyms:
ER-beta ESR2_HUMAN Estradiol receptor beta (ERβ) Estrogen receptor (ER beta) Estrogen receptor beta (ER beta) NR3A2 estrogen beta
Type:
Protein
Mol. Mass.:
59238.43
Organism:
Homo sapiens (Human)
Description:
Q92731
Residue:
530
  
Component 2
Name:
Estrogen receptor
Synonyms:
ER ESR ESR1_HUMAN Estrogen receptor Estrogen receptor (ER-alpha) Estrogen receptor alpha (ER) Nuclear receptor subfamily 3 group A member 1
Type:
Protein
Mol. Mass.:
66230.44
Organism:
Homo sapiens (Human)
Description:
P03372
Residue:
595
  
Inhibitor
Name:
BDBM50129152
Synonyms:
(6S,8S,10R,14S,15S)-17-Acetyl-6,10-dimethyl-13-(R)-methyl-17-(2-oxo-propyl)-1,2,6,7,8,9,10,11,12,13,14,15,16,17-tetradecahydro-cyclopenta[a]phenanthren-3-one | CHEMBL292284
Type:
Small organic molecule
Emp. Form.:
C25H36O3
Mol. Mass.:
384.5515
SMILES:
C[C@H]1CC2[C@@H]3CC[C@](CC(C)=O)(C(C)=O)[C@@]3(C)CC[C@@H]2[C@@]2(C)CCC(=O)C=C12
: