Target
Progesterone receptor
Ligand
BDBM50129149
Substrate
Meas. Tech.
ChEMBL_159550 (CHEMBL765838)
Ki
6.3±n/a nM
Citation
 Zhi, LTegley, CMPio, BEdwards, JPJones, TKMarschke, KBMais, DERisek, BSchrader, WT Synthesis and biological activity of 5-methylidene 1,2-dihydrochromeno[3,4-f]quinoline derivatives as progesterone receptor modulators. Bioorg Med Chem Lett 13:2071-4 (2003)  
Target
Name:
Progesterone receptor
Synonyms:
NR3C3 PGR PRGR_HUMAN | progesterone
Type:
Protein
Mol. Mass.:
98979.52
Organism:
Homo sapiens (Human)
Description:
P06401
Residue:
933
  
Inhibitor
Name:
BDBM50129149
Synonyms:
5-[1,3]Dithian-2-ylidene-9-fluoro-2,2,4-trimethyl-2,5-dihydro-1H-6-oxa-1-aza-chrysene | CHEMBL65929
Type:
Small organic molecule
Emp. Form.:
C23H22FNOS2
Mol. Mass.:
411.555
SMILES:
[#6]-[#6]-1=[#6]C([#6])([#6])[#7]-c2ccc3-c4cc(F)ccc4-[#8]\[#6](=[#6]-4/[#16]-[#6]-[#6]-[#6]-[#16]-4)-c3c-12
: