Target
Progesterone receptor
Ligand
BDBM50129147
Substrate
Meas. Tech.
ChEMBL_159384 (CHEMBL768817)
IC50
800±n/a nM
Citation
 Zhi, LTegley, CMPio, BEdwards, JPJones, TKMarschke, KBMais, DERisek, BSchrader, WT Synthesis and biological activity of 5-methylidene 1,2-dihydrochromeno[3,4-f]quinoline derivatives as progesterone receptor modulators. Bioorg Med Chem Lett 13:2071-4 (2003)  
Target
Name:
Progesterone receptor
Synonyms:
NR3C3 PGR PRGR_HUMAN | progesterone
Type:
Protein
Mol. Mass.:
98979.52
Organism:
Homo sapiens (Human)
Description:
P06401
Residue:
933
  
Inhibitor
Name:
BDBM50129147
Synonyms:
5-Cyclohexylmethylene-9-fluoro-2,2,4-trimethyl-2,5-dihydro-1H-6-oxa-1-aza-chrysene | CHEMBL418670
Type:
Small organic molecule
Emp. Form.:
C26H28FNO
Mol. Mass.:
389.505
SMILES:
CC1=CC(C)(C)Nc2ccc3-c4cc(F)ccc4O\C(=C/C4CCCCC4)c3c12
: