Target
Progesterone receptor
Ligand
BDBM50129154
Substrate
Meas. Tech.
ChEMBL_159550 (CHEMBL765838)
Ki
>100±n/a nM
Citation
 Zhi, LTegley, CMPio, BEdwards, JPJones, TKMarschke, KBMais, DERisek, BSchrader, WT Synthesis and biological activity of 5-methylidene 1,2-dihydrochromeno[3,4-f]quinoline derivatives as progesterone receptor modulators. Bioorg Med Chem Lett 13:2071-4 (2003)  
Target
Name:
Progesterone receptor
Synonyms:
NR3C3 PGR PRGR_HUMAN | progesterone
Type:
Protein
Mol. Mass.:
98979.52
Organism:
Homo sapiens (Human)
Description:
P06401
Residue:
933
  
Inhibitor
Name:
BDBM50129154
Synonyms:
1-[9-Fluoro-2,2,4-trimethyl-1,2-dihydro-6-oxa-1-aza-chrysen-(5Z)-ylidene]-propan-2-one | CHEMBL65227
Type:
Small organic molecule
Emp. Form.:
C22H20FNO2
Mol. Mass.:
349.3981
SMILES:
CC(=O)C=C1Oc2ccc(F)cc2-c2ccc3NC(C)(C)C=C(C)c3c12
: