Target
Mineralocorticoid receptor
Ligand
BDBM50129149
Substrate
Meas. Tech.
ChEBML_123497
IC50
681±n/a nM
Citation
 Zhi, LTegley, CMPio, BEdwards, JPJones, TKMarschke, KBMais, DERisek, BSchrader, WT Synthesis and biological activity of 5-methylidene 1,2-dihydrochromeno[3,4-f]quinoline derivatives as progesterone receptor modulators. Bioorg Med Chem Lett 13:2071-4 (2003)  
Target
Name:
Mineralocorticoid receptor
Synonyms:
MCR MLR NR3C2 | Nuclear receptor subfamily 3 group C member 2
Type:
Enzyme
Mol. Mass.:
107076.42
Organism:
Homo sapiens (Human)
Description:
P08235
Residue:
984
  
Inhibitor
Name:
BDBM50129149
Synonyms:
5-[1,3]Dithian-2-ylidene-9-fluoro-2,2,4-trimethyl-2,5-dihydro-1H-6-oxa-1-aza-chrysene | CHEMBL65929
Type:
Small organic molecule
Emp. Form.:
C23H22FNOS2
Mol. Mass.:
411.555
SMILES:
[#6]-[#6]-1=[#6]C([#6])([#6])[#7]-c2ccc3-c4cc(F)ccc4-[#8]\[#6](=[#6]-4/[#16]-[#6]-[#6]-[#6]-[#16]-4)-c3c-12
: