Target
Progesterone receptor
Ligand
BDBM50129148
Substrate
Meas. Tech.
ChEBML_159551
Ki
>100±n/a nM
Citation
 Zhi, LTegley, CMPio, BEdwards, JPJones, TKMarschke, KBMais, DERisek, BSchrader, WT Synthesis and biological activity of 5-methylidene 1,2-dihydrochromeno[3,4-f]quinoline derivatives as progesterone receptor modulators. Bioorg Med Chem Lett 13:2071-4 (2003)  
Target
Name:
Progesterone receptor
Synonyms:
NR3C3 PGR PRGR_HUMAN | progesterone
Type:
Protein
Mol. Mass.:
98979.52
Organism:
Homo sapiens (Human)
Description:
P06401
Residue:
933
  
Inhibitor
Name:
BDBM50129148
Synonyms:
CHEMBL65689 | [9-Fluoro-2,2,4-trimethyl-1,2-dihydro-6-oxa-1-aza-chrysen-(5Z)-ylidene]-acetaldehyde
Type:
Small organic molecule
Emp. Form.:
C21H18FNO2
Mol. Mass.:
335.3715
SMILES:
CC1=CC(C)(C)Nc2ccc3-c4cc(F)ccc4O\C(=C/C=O)c3c12
: