Target
Glucocorticoid receptor
Ligand
BDBM50129157
Substrate
Meas. Tech.
ChEMBL_71097 (CHEMBL674945)
IC50
324±n/a nM
Citation
 Zhi, LTegley, CMPio, BEdwards, JPJones, TKMarschke, KBMais, DERisek, BSchrader, WT Synthesis and biological activity of 5-methylidene 1,2-dihydrochromeno[3,4-f]quinoline derivatives as progesterone receptor modulators. Bioorg Med Chem Lett 13:2071-4 (2003)  
Target
Name:
Glucocorticoid receptor
Synonyms:
GCR_HUMAN GRL Glucocorticoid receptor (GRFP) Nuclear receptor subfamily 3 group C member 1
Type:
Enzyme
Mol. Mass.:
85656.87
Organism:
Homo sapiens (Human)
Description:
P04150
Residue:
777
  
Inhibitor
Name:
BDBM50129157
Synonyms:
(Z)-5-(butan-2-ylidene)-9-fluoro-2,2,4-trimethyl-2,5-dihydro-1H-chromeno[3,4-f]quinoline CHEMBL62981
Type:
Small organic molecule
Emp. Form.:
C23H24FNO
Mol. Mass.:
349.4412
SMILES:
CC\C(C)=C1/Oc2ccc(F)cc2-c2ccc3NC(C)(C)C=C(C)c3c12
: