Target
Melanocortin receptor 4
Ligand
BDBM50131242
Substrate
Meas. Tech.
ChEMBL_106356 (CHEMBL714436)
Ki
87±n/a nM
Citation
 Koikov, LNEbetino, FHSolinsky, MGCross-Doersen, DKnittel, JJ Sub-nanomolar hMC1R agonists by end-capping of the melanocortin tetrapeptide His-D-Phe-Arg-Trp-NH(2). Bioorg Med Chem Lett 13:2647-50 (2003)  
Target
Name:
Melanocortin receptor 4
Synonyms:
MC4-R MC4R_HUMAN Melanocortin receptor 4 (MC-4) Melanocortin receptor 4 (MC4R)
Type:
Enzyme
Mol. Mass.:
36949.50
Organism:
Homo sapiens (Human)
Description:
P32245
Residue:
332
  
Inhibitor
Name:
BDBM50131242
Synonyms:
CHEMBL329586 | Cyclopropanecarboxylic acid [(S)-1-((S)-1-{(S)-1-[(S)-1-carbamoyl-2-(1H-indol-3-yl)-ethylcarbamoyl]-4-guanidino-butylcarbamoyl}-2-phenyl-ethylcarbamoyl)-2-(3H-imidazol-4-yl)-ethyl]-amide
Type:
Small organic molecule
Emp. Form.:
C36H45N11O5
Mol. Mass.:
711.8132
SMILES:
NC(=N)NCCC[C@H](NC(=O)[C@H](Cc1ccccc1)NC(=O)[C@H](Cc1cnc[nH]1)NC(=O)C1CC1)C(=O)N[C@@H](Cc1c[nH]c2ccccc12)C(N)=O
: